BDBM50392426 CHEMBL2151791
SMILES CCCCOc1ccc(cc1)C(=O)NC1CCCCC1
InChI Key InChIKey=SMMKODUYHLVHQF-UHFFFAOYSA-N
Data  2 EC50
  Tab Delimited (TSV)   2D SDfile   Computed 3D by Vconf -m prep SDfile
Find this compound or compounds like it in BindingDB:
Activity Spreadsheet -- Enzyme Inhibition Constant Data from BindingDB
Found 2 hits for monomerid = 50392426
TargetMetabotropic glutamate receptor 5(Rattus norvegicus (Rat))
Vanderbilt University Medical Center
Curated by ChEMBL
LigandPNGBDBM50392426(CHEMBL2151791)
Affinity DataEC50:  607nM. Assay description: Positive allosteric modulation of rat mGluR5 expressed in human HEK293 cells assessed as calcium mobilization
In DepthDetails ArticlePubMed
TargetMetabotropic glutamate receptor 5(Rattus norvegicus (Rat))
Vanderbilt University Medical Center
Curated by ChEMBL
LigandPNGBDBM50392426(CHEMBL2151791)
Affinity DataEC50:  603nM. Assay description: Positive allosteric modulation of rat mGluR5 expressed in human HEK293 cells assessed as calcium mobilization
In DepthDetails ArticlePubMed