BDBM50395261 CHEMBL2163594
SMILES CC(C)CN(Cc1ccc2OC(C)(C)C=Cc2c1)S(=O)(=O)c1ccccn1
InChI Key InChIKey=UHOZWOWPCJHMBX-UHFFFAOYSA-N
Data  1 IC50
  Tab Delimited (TSV)   2D SDfile   Computed 3D by Vconf -m prep SDfile
Find this compound or compounds like it in BindingDB:
Activity Spreadsheet -- Enzyme Inhibition Constant Data from BindingDB
Found 1 hit for monomerid = 50395261
TargetHistone acetyltransferase p300(Homo sapiens (Human))
Emory University
Curated by ChEMBL
LigandPNGBDBM50395261(CHEMBL2163594)
Affinity DataIC50:  5.00E+3nM. Assay description: Inhibition of P300 CH1 domain-mediated HIF1 transcriptional activity in human LN229-V6R cells assessed as reduction in luciferase activity incubated ...
In DepthDetails ArticlePubMed