BDBM50396814 CHEMBL2170094::US8772480, 37
SMILES Cc1nc(N)nc(n1)-c1cc(CN2CCN(CC2)S(C)(=O)=O)cnc1Nc1ccc(nc1)C(F)(F)F
InChI Key InChIKey=POILOEPNLLDHRQ-UHFFFAOYSA-N
Data  4 KI  3 IC50
  Tab Delimited (TSV)   2D SDfile   Computed 3D by Vconf -m prep SDfile
Find this compound or compounds like it in BindingDB:
Activity Spreadsheet -- Enzyme Inhibition Constant Data from BindingDB
Found 7 hits for monomerid = 50396814
LigandPNGBDBM50396814(CHEMBL2170094 | US8772480, 37)
Affinity DataKi:  84nM. Assay description: Inhibition of human N-terminal polyHis-tagged PI3K p110delta/p85alpha expressed in baculovirus infected Sf9 cells using phosphatidylinositol-4,5-bisp...
In DepthDetails ArticlePubMed
LigandPNGBDBM50396814(CHEMBL2170094 | US8772480, 37)
Affinity DataKi:  106nM. Assay description: Inhibition of human N-terminal polyHis-tagged PI3K p110alpha/p85alpha expressed in baculovirus infected Sf9 cells using phosphatidylinositol-4,5-bisp...
In DepthDetails ArticlePubMed
LigandPNGBDBM50396814(CHEMBL2170094 | US8772480, 37)
Affinity DataKi:  129nM. Assay description: The PI3K AlphaScreen assay (PerkinElmer, Waltham, Mass.) measures the activity of a panel of four phosphoinositide 3-kinases: PI3Kalpha, PI3Kbeta, PI...
In DepthDetails US Patent
LigandPNGBDBM50396814(CHEMBL2170094 | US8772480, 37)
Affinity DataKi:  136nM. Assay description: Inhibition of human N-terminal polyHis-tagged PI3K p110gamma expressed in baculovirus infected Hi5 cells using ATP as substrate after 20 mins by spec...
In DepthDetails ArticlePubMed
TargetSerine/threonine-protein kinase mTOR(Homo sapiens (Human))
Amgen
Curated by ChEMBL
LigandPNGBDBM50396814(CHEMBL2170094 | US8772480, 37)
Affinity DataIC50: >1.00E+4nM. Assay description: Inhibition of mTOR
In DepthDetails ArticlePubMed
TargetSerine/threonine-protein kinase mTOR(Homo sapiens (Human))
Amgen
Curated by ChEMBL
LigandPNGBDBM50396814(CHEMBL2170094 | US8772480, 37)
Affinity DataIC50: >1.00E+4nM. Assay description: The Invitrogen (Carlsbad, Calif.) mammalian target of rapamycin (mTOR) Lanthascreen assay can be used to quantitate mTOR kinase activity in an in vit...
In DepthDetails US Patent
TargetPhosphatidylinositol 3-kinase catalytic subunit type 3(Homo sapiens (Human))
Amgen
Curated by ChEMBL
LigandPNGBDBM50396814(CHEMBL2170094 | US8772480, 37)
Affinity DataIC50: >1.00E+4nM. Assay description: Inhibition of human VPS34
In DepthDetails ArticlePubMed