BDBM50397914 CHEMBL2179957
SMILES O=C(N1CC2CNCC2C1)c1cnco1
InChI Key InChIKey=CRHHYTWGPWXCHF-UHFFFAOYSA-N
Data  2 KI  1 EC50
  Tab Delimited (TSV)   2D SDfile   Computed 3D by Vconf -m prep SDfile
Find this compound or compounds like it in BindingDB:
Activity Spreadsheet -- Enzyme Inhibition Constant Data from BindingDB
Found 3 hits for monomerid = 50397914
TargetNeuronal acetylcholine receptor subunit alpha-4/beta-2(Homo sapiens (Human))
Targacept
Curated by ChEMBL
LigandPNGBDBM50397914(CHEMBL2179957)
Affinity DataKi:  110nM. Assay description: Displacement of [3H]nicotine from alpha4beta2 nAChR in human SH-EP1 cells after 2 hrs by liquid scintillation assay
In DepthDetails ArticlePubMed
TargetNeuronal acetylcholine receptor subunit alpha-7(Homo sapiens (Human))
Targacept
Curated by ChEMBL
LigandPNGBDBM50397914(CHEMBL2179957)
Affinity DataKi:  7.60E+3nM. Assay description: Displacement of [3H]epibatidine from human alpha7 nAChR expressed in CHO cells after 2 hrs by liquid scintillation counting
In DepthDetails ArticlePubMed
TargetNeuronal acetylcholine receptor subunit alpha-4/beta-2(Homo sapiens (Human))
Targacept
Curated by ChEMBL
LigandPNGBDBM50397914(CHEMBL2179957)
Affinity DataEC50:  4.20E+3nM. Assay description: Agonist activity at alpha4beta2 nAChR in human SH-EP1 cells assessed as calcium flux by calcium4-based FLIPR assay
In DepthDetails ArticlePubMed