BDBM50398695 CHEMBL2178719
SMILES CN1C(N)=N[C@]2(CN(C[C@H]2C1=O)c1ncc(Cl)cn1)c1cc(cs1)-c1cccc(c1)C#N
InChI Key InChIKey=IBKRVASDDLTZLT-JTSKRJEESA-N
Data  1 KI  1 IC50
  Tab Delimited (TSV)   2D SDfile   Computed 3D by Vconf -m prep SDfile
Find this compound or compounds like it in BindingDB:
Activity Spreadsheet -- Enzyme Inhibition Constant Data from BindingDB
Found 2 hits for monomerid = 50398695
TargetBeta-secretase 1(Homo sapiens (Human))
Merck Research Laboratories
Curated by ChEMBL
LigandPNGBDBM50398695(CHEMBL2178719)
Affinity DataKi:  7nM. Assay description: Inhibition of BACE1
In DepthDetails ArticlePubMed
TargetBeta-secretase 1(Homo sapiens (Human))
Merck Research Laboratories
Curated by ChEMBL
LigandPNGBDBM50398695(CHEMBL2178719)
Affinity DataIC50:  51nM. Assay description: Inhibition of BACE1 in HEK293 cells
In DepthDetails ArticlePubMed