BDBM50401971 CHEMBL2207955
SMILES Cc1ccc(cc1)C1=C\C(=C/C#N)N2C(Sc3ccccc23)=N1
InChI Key InChIKey=ISBONGPRSZGVKV-XNTDXEJSSA-N
Data  2 IC50
  Tab Delimited (TSV)   2D SDfile   Computed 3D by Vconf -m prep SDfile
Find this compound or compounds like it in BindingDB:
Activity Spreadsheet -- Enzyme Inhibition Constant Data from BindingDB
Found 2 hits for monomerid = 50401971
TargetLysosomal alpha-glucosidase(Mus musculus (Mouse))
North Maharashtra University
Curated by ChEMBL
LigandPNGBDBM50401971(CHEMBL2207955)
Affinity DataIC50:  2.03E+4nM. Assay description: Inhibition of liver glucosidase in Swiss mouse liver extracts
In DepthDetails ArticlePubMed
TargetPancreatic alpha-amylase(Sus scrofa (Pig))
North Maharashtra University
Curated by ChEMBL
LigandPNGBDBM50401971(CHEMBL2207955)
Affinity DataIC50:  2.32E+4nM. Assay description: Inhibition of porcine pancreatic alpha amylase using starch as substrate by Bernfeld method
In DepthDetails ArticlePubMed