BDBM50403987 CHEMBL315308
SMILES CN(C)CC1CC2N(O1)c1cc(ccc1Cc1ccccc21)-c1ccccc1
InChI Key InChIKey=RUWZQSJWDUNAEU-UHFFFAOYSA-N
Data  3 IC50
  Tab Delimited (TSV)   2D SDfile   Computed 3D by Vconf -m prep SDfile
Find this compound or compounds like it in BindingDB:
Activity Spreadsheet -- Enzyme Inhibition Constant Data from BindingDB
Found 3 hits for monomerid = 50403987
Target5-hydroxytryptamine receptor 2A(Homo sapiens (Human))
Janssen-Cilag
Curated by ChEMBL
LigandPNGBDBM50403987(CHEMBL315308)
Affinity DataIC50:  22nM. Assay description: Binding affinity for human cloned 5-HT2A receptor expressed in L929 cells using [125I]R91150 as radioligand
In DepthDetails ArticlePubMed
TargetHistamine H1 receptor(Homo sapiens (Human))
Janssen-Cilag
Curated by ChEMBL
LigandPNGBDBM50403987(CHEMBL315308)
Affinity DataIC50:  7.90nM. Assay description: Binding affinity at human cloned Histamine H1 receptor expressed in CHO cells by [3H]pyrilamine displacement.
In DepthDetails ArticlePubMed
Target5-hydroxytryptamine receptor 2C(Homo sapiens (Human))
Janssen-Cilag
Curated by ChEMBL
LigandPNGBDBM50403987(CHEMBL315308)
Affinity DataIC50:  11nM. Assay description: Binding affinity at human cloned 5-hydroxytryptamine 2C receptor expressed in CHO cells by [3H]mesulergine displacement.
In DepthDetails ArticlePubMed