BDBM50405920 CHEMBL176714::CHEMBL3349042
SMILES CCCCCCSC[C@H]1C2CC[C@@H](O2)[C@H]1C\C=C/CCCC(O)=O
InChI Key InChIKey=KJSNNKBWTXQJLG-YVMONPNESA-N
Data  1 Kd
  Tab Delimited (TSV)   2D SDfile   Computed 3D by Vconf -m prep SDfile
Find this compound or compounds like it in BindingDB:
Activity Spreadsheet -- Enzyme Inhibition Constant Data from BindingDB
Found 1 hit for monomerid = 50405920
TargetThromboxane A2 receptor(Homo sapiens (Human))
Squibb Institute For Medical Research
Curated by ChEMBL
LigandPNGBDBM50405920(CHEMBL176714 | CHEMBL3349042)
Affinity DataKd:  1.60nM. Assay description: Compound was evaluated for inhibition of specific binding of HSQ (5,6-di-3H-SQ 29,548) in washed platelets
In DepthDetails ArticlePubMed