BDBM50409941 CHEMBL185374
SMILES Cc1ccc(cc1)S(=O)(=O)NC(CNC(=O)c1cc2cc(OCCONC(=N)NC(=O)OC(C)(C)C)ccc2[nH]1)C(O)=O
InChI Key InChIKey=AMUWEMRWOCLRIU-UHFFFAOYSA-N
Data  1 IC50
  Tab Delimited (TSV)   2D SDfile   Computed 3D by Vconf -m prep SDfile
Find this compound or compounds like it in BindingDB:
Activity Spreadsheet -- Enzyme Inhibition Constant Data from BindingDB
Found 1 hit for monomerid = 50409941
TargetIntegrin alpha-V/beta-3(Homo sapiens (Human))
3-Dimensional Pharmaceuticals
Curated by ChEMBL
LigandPNGBDBM50409941(CHEMBL185374)
Affinity DataIC50:  130nM. Assay description: In vitro inhibitory activity against alpha v beta 3 vitronectin protein interaction was measured by ELISA
In DepthDetails ArticlePubMed