BDBM50412510 CHEMBL454882::VUF-10500
SMILES CN1CCN(CC1)c1nc(NCc2ccco2)c2cc(F)ccc2n1
InChI Key InChIKey=XQGYAVULGKMZFC-UHFFFAOYSA-N
Data  2 KI
  Tab Delimited (TSV)   2D SDfile   Computed 3D by Vconf -m prep SDfile
Find this compound or compounds like it in BindingDB:
Activity Spreadsheet -- Enzyme Inhibition Constant Data from BindingDB
Found 2 hits for monomerid = 50412510
TargetHistamine H4 receptor(Homo sapiens (Human))
Vrije Universiteit Amsterdam
Curated by ChEMBL
LigandPNGBDBM50412510(CHEMBL454882 | VUF-10500)
Affinity DataKi:  224nM. Assay description: Displacement of [3H]histamine from human histamine H4 receptor expressed in HEK cells
In DepthDetails ArticlePubMed
TargetHistamine H4 receptor(Homo sapiens (Human))
Vrije Universiteit Amsterdam
Curated by ChEMBL
LigandPNGBDBM50412510(CHEMBL454882 | VUF-10500)
Affinity DataKi:  224nM. Assay description: Displacement of [3H]histamine from human histamine H4 receptor expressed in HEK293T cells
In DepthDetails ArticlePubMed