BDBM50423679 CHEMBL566091
SMILES OC(=O)[C@H]1CC[C@@H](CC1)OC[C@@H]1C[C@H](F)CN1C(=O)Cc1cc(Cl)c(NC(=O)N2CCc3ccccc23)cc1F
InChI Key InChIKey=RXLWNGYRRWWRFV-QESAQDPVSA-N
Data  2 IC50
  Tab Delimited (TSV)   2D SDfile   Computed 3D by Vconf -m prep SDfile
Find this compound or compounds like it in BindingDB:
Activity Spreadsheet -- Enzyme Inhibition Constant Data from BindingDB
Found 2 hits for monomerid = 50423679
TargetIntegrin alpha-4/beta-1(Homo sapiens (Human))
Daiichi Sankyo
Curated by ChEMBL
LigandPNGBDBM50423679(CHEMBL566091)
Affinity DataIC50:  171nM. Assay description: Inhibition of europium labeled human VCAM1/Fc chimera binding to human VLA-4 alpha-4-beta-1 expressed in Chinese hamster 4B4 cells in presence of 3% ...
In DepthDetails ArticlePubMed
TargetIntegrin alpha-4/beta-1(Homo sapiens (Human))
Daiichi Sankyo
Curated by ChEMBL
LigandPNGBDBM50423679(CHEMBL566091)
Affinity DataIC50:  2.70nM. Assay description: Inhibition of europium labeled human VCAM1/Fc chimera binding to human VLA-4 alpha-4-beta-1 expressed in Chinese hamster 4B4 cells by fluorimetric as...
In DepthDetails ArticlePubMed