BDBM50426072 CHEMBL1190520
SMILES OC(=O)[C@@H]1CCCN(CCOCCC(c2ccccc2)c2ccccc2)C1
InChI Key InChIKey=DEGMILQNXHRUSN-OAQYLSRUSA-N
Data  2 IC50
  Tab Delimited (TSV)   2D SDfile   Computed 3D by Vconf -m prep SDfile
Find this compound or compounds like it in BindingDB:
Activity Spreadsheet -- Enzyme Inhibition Constant Data from BindingDB
Found 2 hits for monomerid = 50426072
TargetSodium- and chloride-dependent GABA transporter 1(Mus musculus)
Ludwig Maximilians University At Munich
Curated by ChEMBL
LigandPNGBDBM50426072(CHEMBL1190520)
Affinity DataIC50:  55nM. Assay description: Inhibition of [3H]GABA uptake at mouse GAT1 expressed in HEK293 cells after 25 mins by scintillation counting analysis
In DepthDetails ArticlePubMed
TargetSodium- and chloride-dependent GABA transporter 1(Rattus norvegicus)
University Of Vienna
Curated by ChEMBL
LigandPNGBDBM50426072(CHEMBL1190520)
Affinity DataIC50:  60nM. Assay description: Inhibition of rat brain synaptosomes GAT1 assessed as inhibition of [3H]GABA uptake by liquid scintillation counting
In DepthDetails ArticlePubMed