BDBM50426582 CHEMBL2324678
SMILES COc1ccc(cc1)-c1ccc(s1)C(=O)N(C)c1cccc(OC)c1
InChI Key InChIKey=XISHUJLWMPRKSU-UHFFFAOYSA-N
Data  2 IC50
  Tab Delimited (TSV)   2D SDfile   Computed 3D by Vconf -m prep SDfile
Find this compound or compounds like it in BindingDB:
Activity Spreadsheet -- Enzyme Inhibition Constant Data from BindingDB
Found 2 hits for monomerid = 50426582
Target17-beta-hydroxysteroid dehydrogenase type 2(Homo sapiens (Human))
Saarland University
Curated by ChEMBL
LigandPNGBDBM50426582(CHEMBL2324678)
Affinity DataIC50:  148nM. Assay description: Inhibition of 17beta-HSD2 in human placental microsomal fraction using [3H]E2 as substrate assessed as formation of E1 by HPLC analysis
In DepthDetails ArticlePubMed
Target17-beta-hydroxysteroid dehydrogenase type 1(Homo sapiens (Human))
Saarland University
Curated by ChEMBL
LigandPNGBDBM50426582(CHEMBL2324678)
Affinity DataIC50:  6.22E+3nM. Assay description: Inhibition of 17beta-HSD1 in human placental cytosolic fraction using [3H]E1 as substrate assessed as formation of E2 by HPLC analysis
In DepthDetails ArticlePubMed