BDBM50429539 CHEMBL2333769
SMILES CN(c1ccccc1C(C)(C)C)c1ncccc1NC(=O)Nc1ccc(C)cc1
InChI Key InChIKey=ALIUHWLCEJCTQS-UHFFFAOYSA-N
Data  2 KI
  Tab Delimited (TSV)   2D SDfile   Computed 3D by Vconf -m prep SDfile
Find this compound or compounds like it in BindingDB:
Activity Spreadsheet -- Enzyme Inhibition Constant Data from BindingDB
Found 2 hits for monomerid = 50429539
TargetP2Y purinoceptor 1(Homo sapiens (Human))TBA
LigandPNGBDBM50429539(CHEMBL2333769)
Affinity DataKi: >5.00E+3nM. Assay description: Inhibition of human P2Y1 assessed as inhibition constant
In DepthDetails PubMed
TargetP2Y purinoceptor 1(Homo sapiens (Human))TBA
LigandPNGBDBM50429539(CHEMBL2333769)
Affinity DataKi: >5.00E+3nM. Assay description: Displacement of [beta-33P]-2MeS-ADP from human P2Y1 receptor transfected in HEK293 cells assessed as residual [beta-33P] bound to plate after 1 hr by...
In DepthDetails ArticlePubMed