BDBM50438564 CHEMBL2413152
SMILES CC(C)(N)C(=O)N[C@H](Cc1c[nH]c2ccccc12)C(=O)N1CCC2(C[C@H](O)c3ccccc23)CC1
InChI Key InChIKey=QKKILULFJWHMHC-RPWUZVMVSA-N
Data  1 EC50
  Tab Delimited (TSV)   2D SDfile   Computed 3D by Vconf -m prep SDfile
Find this compound or compounds like it in BindingDB:
Activity Spreadsheet -- Enzyme Inhibition Constant Data from BindingDB
Found 1 hit for monomerid = 50438564
TargetGrowth hormone secretagogue receptor type 1(Homo sapiens (Human))
Universit£
Curated by ChEMBL
LigandPNGBDBM50438564(CHEMBL2413152)
Affinity DataEC50:  0.600nM. Assay description: Agonist activity at GHS-R1a (unknown origin)
In DepthDetails ArticlePubMed