BDBM50439818 CHEMBL2419899
SMILES CN(C)c1ccc(cc1)-c1nc2CCOCc2c(=O)[nH]1
InChI Key InChIKey=ODEPXKKHOIPXKH-UHFFFAOYSA-N
Data  1 IC50
  Tab Delimited (TSV)   2D SDfile   Computed 3D by Vconf -m prep SDfile
Find this compound or compounds like it in BindingDB:
Activity Spreadsheet -- Enzyme Inhibition Constant Data from BindingDB
Found 1 hit for monomerid = 50439818
TargetProtein Wnt-3a(Homo sapiens (Human))
Novartis Institutes For Biomedical Research
Curated by ChEMBL
LigandPNGBDBM50439818(CHEMBL2419899)
Affinity DataIC50:  4.21E+3nM. Assay description: Inhibition of WNT3A signaling in HEK293 cells by luciferase reporter gene assay in presence of forskolin
In DepthDetails ArticlePubMed