BDBM50441805 CHEMBL2436322::US10053431, 5
SMILES CN[C@@H](C)C(=O)N[C@H]1CN(C)c2ccccc2N(Cc2cccc3ccccc23)C1=O
InChI Key InChIKey=SFOIEDLMYJHJGW-UWJYYQICSA-N
Data  4 IC50
  Tab Delimited (TSV)   2D SDfile   Computed 3D by Vconf -m prep SDfile
Find this compound or compounds like it in BindingDB:
Activity Spreadsheet -- Enzyme Inhibition Constant Data from BindingDB
Found 4 hits for monomerid = 50441805
TargetE3 ubiquitin-protein ligase XIAP(Homo sapiens (Human))
Hoffmann-La Roche
Curated by ChEMBL
LigandPNGBDBM50441805(CHEMBL2436322 | US10053431, 5)
Affinity DataIC50: >5.40E+4nM. Assay description: Displacement of AVPIAQKSEK (epsilon-biotin)-OH from 6xhistidine-thrombin-TEV-tagged XIAP BIR3 domain (241 to 356) (unknown origin) after 45 mins by T...
In DepthDetails ArticlePubMed
TargetE3 ubiquitin-protein ligase XIAP [241-356](Homo sapiens (Human))
Hoffmann-La Roche
US Patent
LigandPNGBDBM50441805(CHEMBL2436322 | US10053431, 5)
Affinity DataIC50: >5.40E+4nMpH: 7.5 T: 2°C. Assay description: Ten nanomolar of 6× Histidine-tagged BIR2 domain, corresponding to amino acids 124-240 of XIAP, or BIR3 domain, corresponding to amino acids 241-356 ...
In DepthDetails US Patent
TargetE3 ubiquitin-protein ligase XIAP [124-240](Homo sapiens (Human))
Hoffmann-La Roche
US Patent
LigandPNGBDBM50441805(CHEMBL2436322 | US10053431, 5)
Affinity DataIC50:  4.36E+3nMpH: 7.5 T: 2°C. Assay description: Ten nanomolar of 6× Histidine-tagged BIR2 domain, corresponding to amino acids 124-240 of XIAP, or BIR3 domain, corresponding to amino acids 241-356 ...
In DepthDetails US Patent
TargetE3 ubiquitin-protein ligase XIAP(Homo sapiens (Human))
Hoffmann-La Roche
Curated by ChEMBL
LigandPNGBDBM50441805(CHEMBL2436322 | US10053431, 5)
Affinity DataIC50:  4.36E+3nM. Assay description: Displacement of AVPIAQKSEK (epsilon-biotin)-OH from 6xhistidine-thrombin-TEV-tagged XIAP BIR2 domain (124 to 240) (unknown origin) after 45 mins by T...
In DepthDetails ArticlePubMed