BDBM50444959 CHEMBL3099774
SMILES COc1cccc(OC)c1-c1nc(cn1-c1ccnc2cc(Cl)ccc12)C(=O)N[C@H](CC(C)C)C(O)=O
InChI Key InChIKey=OUZUXYQXCXYGMX-LJQANCHMSA-N
Data  1 EC50
  Tab Delimited (TSV)   2D SDfile   Computed 3D by Vconf -m prep SDfile
Find this compound or compounds like it in BindingDB:
Activity Spreadsheet -- Enzyme Inhibition Constant Data from BindingDB
Found 1 hit for monomerid = 50444959
TargetNeurotensin receptor type 1(Homo sapiens (Human))
Sanford-Burnham Medical Research Institute
Curated by ChEMBL
LigandPNGBDBM50444959(CHEMBL3099774)
Affinity DataEC50:  9.40E+3nM. Assay description: Agonist activity at NTR1 in human U2OS cells after 1 hr by beta-arrestin GFP reporter gene assay
In DepthDetails ArticlePubMed