BDBM50446123 CHEMBL3108836
SMILES Cc1cc(NS(=O)(=O)c2ccc(NCCc3ccc(Cl)c(Cl)c3)cc2)no1
InChI Key InChIKey=DLSFAJHHDXJOAO-UHFFFAOYSA-N
Data  2 IC50
  Tab Delimited (TSV)   2D SDfile   Computed 3D by Vconf -m prep SDfile
Find this compound or compounds like it in BindingDB:
Activity Spreadsheet -- Enzyme Inhibition Constant Data from BindingDB
Found 2 hits for monomerid = 50446123
TargetATP-dependent 6-phosphofructokinase(Trypanosoma brucei)
National Center For Advancing Translational Sciences
Curated by ChEMBL
LigandPNGBDBM50446123(CHEMBL3108836)
Affinity DataIC50:  6.00E+3nM. Assay description: Inhibition of Trypanosoma brucei PFK-mediated ADP production using ATP/fructose-6-phosphate as substrate by luciferase based luminescence assay
In DepthDetails ArticlePubMed
TargetATP-dependent 6-phosphofructokinase(Trypanosoma cruzi)
National Center For Advancing Translational Sciences
Curated by ChEMBL
LigandPNGBDBM50446123(CHEMBL3108836)
Affinity DataIC50:  1.63E+4nM. Assay description: Inhibition of Trypanosoma cruzi PFK
In DepthDetails ArticlePubMed