BDBM50449594 CHEMBL4159299
SMILES Clc1ccc(COc2cccc(\C=C3/SC(=O)NC3=O)c2)cc1
InChI Key InChIKey=LTJRZRNWJPPHRZ-DHDCSXOGSA-N
Data  2 KI  2 IC50  2 EC50
  Tab Delimited (TSV)   2D SDfile   Computed 3D by Vconf -m prep SDfile
Find this compound or compounds like it in BindingDB:
Activity Spreadsheet -- Enzyme Inhibition Constant Data from BindingDB
Found 6 hits for monomerid = 50449594
TargetCannabinoid receptor 1(Homo sapiens (Human))
University Of Bonn
Curated by ChEMBL
LigandPNGBDBM50449594(CHEMBL4159299)
Affinity DataKi:  5.04E+3nM. Assay description: Displacement of [3H]CP55940 from recombinant human CB1 receptor expressed in CHO cell membranes after 2 hrs by liquid scintillation counting method
In DepthDetails ArticlePubMed
TargetCannabinoid receptor 2(Homo sapiens (Human))
University Of Bonn
Curated by ChEMBL
LigandPNGBDBM50449594(CHEMBL4159299)
Affinity DataKi: >1.00E+4nM. Assay description: Displacement of [3H]CP55940 from recombinant human CB2 receptor expressed in CHO cell membranes after 2 hrs by liquid scintillation counting method
In DepthDetails ArticlePubMed
TargetN-arachidonyl glycine receptor(Homo sapiens (Human))
University Of Bonn
Curated by ChEMBL
LigandPNGBDBM50449594(CHEMBL4159299)
Affinity DataIC50: >1.00E+4nM. Assay description: Antagonist activity at recombinant human GPR18 expressed in CHO cells assessed as inhibition of delta9-THC-induced beta-arrestin recruitment preincub...
In DepthDetails ArticlePubMed
TargetN-arachidonyl glycine receptor(Homo sapiens (Human))
University Of Bonn
Curated by ChEMBL
LigandPNGBDBM50449594(CHEMBL4159299)
Affinity DataEC50: >1.00E+4nM. Assay description: Agonist activity at recombinant human GPR18 expressed in CHO cells assessed as increase in beta-arrestin recruitment incubated for 60 mins measured f...
In DepthDetails ArticlePubMed
TargetG-protein coupled receptor 55(Homo sapiens (Human))
University Of Bonn
Curated by ChEMBL
LigandPNGBDBM50449594(CHEMBL4159299)
Affinity DataIC50: >1.00E+4nM. Assay description: Antagonist activity at recombinant human GPR55 expressed in CHO cells assessed as inhibition of lysophosphatidylinositol-induced beta-arrestin recrui...
In DepthDetails ArticlePubMed
TargetG-protein coupled receptor 55(Homo sapiens (Human))
University Of Bonn
Curated by ChEMBL
LigandPNGBDBM50449594(CHEMBL4159299)
Affinity DataEC50: >1.00E+4nM. Assay description: Agonist activity at recombinant human GPR55 expressed in CHO cells assessed as increase in beta-arrestin recruitment incubated for 60 mins measured f...
In DepthDetails ArticlePubMed