BDBM50454602 CHEMBL2112285
SMILES O\C(=C/C(=O)C1CCN(Cc2ccccc2)CC1)c1ccc(Cl)cc1
InChI Key InChIKey=IALFUNSVFHBTHD-ZHZULCJRSA-N
Data  3 KI
  Tab Delimited (TSV)   2D SDfile   Computed 3D by Vconf -m prep SDfile
Find this compound or compounds like it in BindingDB:
Activity Spreadsheet -- Enzyme Inhibition Constant Data from BindingDB
Found 3 hits for monomerid = 50454602
TargetD(4) dopamine receptor(Homo sapiens (Human))
Merck Sharp And Dohme Research Laboratories
Curated by ChEMBL
LigandPNGBDBM50454602(CHEMBL2112285)
Affinity DataKi:  12nM. Assay description: Ability to displace [3H]-spiperone from human dopamine receptor D4 (hD4) receptor stably expressed in HEK-293 cells.
In DepthDetails ArticlePubMed
TargetD(2) dopamine receptor(Homo sapiens (Human))
Merck Sharp And Dohme Research Laboratories
Curated by ChEMBL
LigandPNGBDBM50454602(CHEMBL2112285)
Affinity DataKi:  120nM. Assay description: Ability to displace [3H]-spiperone from human dopamine receptor D2 stably expressed in CHO cells.
In DepthDetails ArticlePubMed
TargetD(3) dopamine receptor(Homo sapiens (Human))
Merck Sharp And Dohme Research Laboratories
Curated by ChEMBL
LigandPNGBDBM50454602(CHEMBL2112285)
Affinity DataKi:  510nM. Assay description: Ability to displace [3H]-spiperone from human dopamine receptor D3 (hD3) receptor stably expressed in HEK-293 cells.
In DepthDetails ArticlePubMed