BDBM50457551 CHEMBL4217953
SMILES COCCOCOc1ccc(cc1-c1ccc2c(c1)C(C)(C)CCC2(C)C)-c1ccc(cc1)C(O)=O
InChI Key InChIKey=ONCNXZYLXTZCOJ-UHFFFAOYSA-N
Data  3 EC50
  Tab Delimited (TSV)   2D SDfile   Computed 3D by Vconf -m prep SDfile
Find this compound or compounds like it in BindingDB:
Activity Spreadsheet -- Enzyme Inhibition Constant Data from BindingDB
Found 3 hits for monomerid = 50457551
TargetRetinoic acid receptor gamma(Homo sapiens (Human))
Nestle Skin Health
Curated by ChEMBL
LigandPNGBDBM50457551(CHEMBL4217953)
Affinity DataEC50:  6nM. Assay description: Agonist activity at GAL4 DNA-binding domain-tagged RARgamma (unknown origin) ligand-binding domain expressed in human HG5LN cells incubated for 18 hr...
Ligand InfoPC cidPC sid
In DepthDetails ArticlePubMed
TargetRetinoic acid receptor alpha(Homo sapiens (Human))
Nestle Skin Health
Curated by ChEMBL
LigandPNGBDBM50457551(CHEMBL4217953)
Affinity DataEC50:  34nM. Assay description: Agonist activity at GAL4 DNA-binding domain-tagged RARalpha (unknown origin) ligand-binding domain expressed in human HG5LN cells incubated for 18 hr...
Ligand InfoPC cidPC sid
In DepthDetails ArticlePubMed
TargetRetinoic acid receptor beta(Homo sapiens (Human))
Nestle Skin Health
Curated by ChEMBL
LigandPNGBDBM50457551(CHEMBL4217953)
Affinity DataEC50:  40nM. Assay description: Agonist activity at GAL4 DNA-binding domain-tagged RARbeta (unknown origin) ligand-binding domain expressed in human HG5LN cells incubated for 18 hrs...
Ligand InfoPC cidPC sid
In DepthDetails ArticlePubMed