BDBM50462708 CHEMBL4243773
SMILES CC(C)c1cccc(C(C)C)c1NC(=O)CCSc1nc2ccccc2o1
InChI Key InChIKey=JJOKEZWDTKTOEQ-UHFFFAOYSA-N
Data  1 IC50
  Tab Delimited (TSV)   2D SDfile   Computed 3D by Vconf -m prep SDfile
Find this compound or compounds like it in BindingDB:
Activity Spreadsheet -- Enzyme Inhibition Constant Data from BindingDB
Found 1 hit for monomerid = 50462708
TargetSterol O-acyltransferase 1(Mus musculus)
Kowa
Curated by ChEMBL
LigandPNGBDBM50462708(CHEMBL4243773)
Affinity DataIC50:  470nM. Assay description: Inhibition of ACAT1 in mouse J774 cells assessed as reduction in esterified cholesterol accumulation after 18 hrs in presence of 25-hydroxycholestero...
In DepthDetails ArticlePubMed