BDBM50464425 CHEMBL4284909
SMILES COc1ccc(cc1)S(=O)(=O)N1CCN(Cc2ccc(C)cc2)CC1
InChI Key InChIKey=RFUIXFLGBSHBCN-UHFFFAOYSA-N
Data  1 IC50
  Tab Delimited (TSV)   2D SDfile   Computed 3D by Vconf -m prep SDfile
Find this compound or compounds like it in BindingDB:
Activity Spreadsheet -- Enzyme Inhibition Constant Data from BindingDB
Found 1 hit for monomerid = 50464425
TargetPancreatic alpha-amylase(Sus scrofa (Pig))
University Of Dammam
Curated by ChEMBL
LigandPNGBDBM50464425(CHEMBL4284909)
Affinity DataIC50:  2.06E+3nM. Assay description: Inhibition of porcine pancreatic alpha-amylase using starch as substrate preincubated for 10 mins followed by substrate addition measured after 10 mi...
In DepthDetails ArticlePubMed