BDBM50464768 CHEMBL4291588
SMILES CC1=C[C@H]([C@@H]([C@H](C1)c1ccc(O)cc1O)C(=O)c1ccc(O)cc1O)c1c(O)ccc([C@@H]2CC(=O)c3c(O)cc(O)cc3O2)c1O
InChI Key InChIKey=ZEZOBFSLMMTYFF-OSOCTARVSA-N
Data  6 IC50
  Tab Delimited (TSV)   2D SDfile   Computed 3D by Vconf -m prep SDfile
Find this compound or compounds like it in BindingDB:
Activity Spreadsheet -- Enzyme Inhibition Constant Data from BindingDB
Found 6 hits for monomerid = 50464768
TargetTYR_PHOSPHATASE_2 domain-containing protein(Mycobacterium tuberculosis)
Universidade Federal De Santa Catarina
Curated by ChEMBL
LigandPNGBDBM50464768(CHEMBL4291588)
Affinity DataIC50:  4.68E+3nM. Assay description: Inhibition of Mycobacterium tuberculosis PtpB using p-nitrophenyl phosphate as substrate preincubated for 10 mins followed by substrate addition meas...
Ligand InfoPC cidPC sid
In DepthDetails ArticlePubMed
TargetTyrosine-protein phosphatase non-receptor type 22(Homo sapiens (Human))
Universidade Federal De Santa Catarina
Curated by ChEMBL
LigandPNGBDBM50464768(CHEMBL4291588)
Affinity DataIC50:  1.21E+4nM. Assay description: Inhibition of LYP (unknown origin) using p-nitrophenyl phosphate as substrate preincubated for 10 mins followed by substrate addition measured every ...
Ligand InfoPC cidPC sid
In DepthDetails ArticlePubMed
TargetTyrosine-protein phosphatase non-receptor type 1(Homo sapiens (Human))
Universidade Federal De Santa Catarina
Curated by ChEMBL
LigandPNGBDBM50464768(CHEMBL4291588)
Affinity DataIC50:  7.98E+3nM. Assay description: Inhibition of human PTP1B using p-nitrophenyl phosphate as substrate preincubated for 10 mins followed by substrate addition measured every minute fo...
Ligand InfoPC cidPC sid
In DepthDetails ArticlePubMed
TargetTYR_PHOSPHATASE_2 domain-containing protein(Mycobacterium tuberculosis)
Universidade Federal De Santa Catarina
Curated by ChEMBL
LigandPNGBDBM50464768(CHEMBL4291588)
Affinity DataIC50:  4.70E+3nM. Assay description: Inhibition of Mycobacterium tuberculosis PtpB using p-nitrophenyl phosphate as substrate preincubated for 10 mins followed by substrate addition meas...
Ligand InfoPC cidPC sid
In DepthDetails ArticlePubMed
TargetTyrosine-protein phosphatase non-receptor type 12(Homo sapiens (Human))
Universidade Federal De Santa Catarina
Curated by ChEMBL
LigandPNGBDBM50464768(CHEMBL4291588)
Affinity DataIC50:  1.86E+4nM. Assay description: Inhibition of PTP-PEST (unknown origin) using p-nitrophenyl phosphate as substrate preincubated for 10 mins followed by substrate addition measured e...
Ligand InfoPC cidPC sid
In DepthDetails ArticlePubMed
TargetLow molecular weight protein-tyrosine phosphatase A(Mycobacterium tuberculosis)
Universidade Federal De Santa Catarina
Curated by ChEMBL
LigandPNGBDBM50464768(CHEMBL4291588)
Affinity DataIC50:  1.40E+4nM. Assay description: Inhibition of Mycobacterium tuberculosis PtpA using p-nitrophenyl phosphate as substrate preincubated for 10 mins followed by substrate addition meas...
Ligand InfoPC cidPC sid
In DepthDetails ArticlePubMed