BDBM50479850 CHEMBL475149
SMILES Cn1cncc1C(O)(c1cc2cc(cc(-c3ccccc3)c2o1)C#N)c1ccc(cc1)C#N
InChI Key InChIKey=OCDYJHKSCLBYLE-UHFFFAOYSA-N
Data  1 IC50
  Tab Delimited (TSV)   2D SDfile   Computed 3D by Vconf -m prep SDfile
Find this compound or compounds like it in BindingDB:
Activity Spreadsheet -- Enzyme Inhibition Constant Data from BindingDB
Found 1 hit for monomerid = 50479850
LigandPNGBDBM50479850(CHEMBL475149)
Affinity DataIC50:  2.40nM. Assay description: Inhibition of human FTase
Ligand InfoPC cidPC sid
In DepthDetails ArticlePubMed