BDBM50495192 CHEMBL3105098
SMILES [H][C@@]12C[C@@H](C)[C@]34C=C(C)[C@H](OC(=O)c5ccccc5NC)[C@@]3(O)[C@H](O)C(CO)=C[C@]([H])(C4=O)[C@]1([H])C2(C)C
InChI Key InChIKey=GBNPWIIHHOENSI-YXKOJEMPSA-N
Data  1 EC50
  Tab Delimited (TSV)   2D SDfile   Computed 3D by Vconf -m prep SDfile
Find this compound or compounds like it in BindingDB:
Activity Spreadsheet -- Enzyme Inhibition Constant Data from BindingDB
Found 1 hit for monomerid = 50495192
TargetProtein kinase C delta type(Homo sapiens (Human))
Leo Pharma
Curated by ChEMBL
LigandPNGBDBM50495192(CHEMBL3105098)
Affinity DataEC50:  2.5nM. Assay description: Activation of PKCdelta (unknown origin) after 40 mins
Ligand InfoPC cidPC sid
In DepthDetails ArticlePubMed