BDBM50503314 CHEMBL4457558
SMILES O=C(Cc1ccccn1)Nc1nnc(CC2CC(Cc3nnc(NC(=O)Cc4ccccn4)s3)C2)s1
InChI Key InChIKey=AUKPWEMVERLKJN-UHFFFAOYSA-N
Data  1 IC50
  Tab Delimited (TSV)   2D SDfile   Computed 3D by Vconf -m prep SDfile
Find this compound or compounds like it in BindingDB:
Activity Spreadsheet -- Enzyme Inhibition Constant Data from BindingDB
Found 1 hit for monomerid = 50503314
TargetGlutaminase kidney isoform, mitochondrial(Homo sapiens (Human))
TBA
Curated by ChEMBL
LigandPNGBDBM50503314(CHEMBL4457558)
Affinity DataIC50:  2.00E+3nM. Assay description: Inhibition of GAC (unknown origin) assessed as NADH formation using 1.8 to 13 mM glutamine as substrate preincubated for 60 mins by resorufin dye bas...
Ligand InfoPC cidPC sid
In DepthDetails ArticlePubMed