BDBM50517142 CHEMBL4566228
SMILES C(N(Cc1ccc(cc1)-c1ccccc1-c1nnn[nH]1)c1nc2ccccc2o1)c1ccncc1
InChI Key InChIKey=VHPIVYWHDCPOSX-UHFFFAOYSA-N
Data  2 IC50  1 EC50
  Tab Delimited (TSV)   2D SDfile   Computed 3D by Vconf -m prep SDfile
Find this compound or compounds like it in BindingDB:
Activity Spreadsheet -- Enzyme Inhibition Constant Data from BindingDB
Found 3 hits for monomerid = 50517142
TargetChemerin-like receptor 1(Homo sapiens (Human))
Kyowa Kirin
Curated by ChEMBL
LigandPNGBDBM50517142(CHEMBL4566228)
Affinity DataIC50: >1.00E+4nM. Assay description: Inhibition of chemR23 in human CAL1 cells assessed as reduction in chemerin-induced intracellular calcium ion concentration preincubated for 45 mins ...
Ligand InfoPC cidPC sid
In DepthDetails ArticlePubMed
TargetChemerin-like receptor 1(Homo sapiens (Human))
Kyowa Kirin
Curated by ChEMBL
LigandPNGBDBM50517142(CHEMBL4566228)
Affinity DataEC50: >1.00E+4nM. Assay description: Agonist activity at chemR23 expressed in human CAL1 cells assessed as increase in intracellular calcium ion concentration
Ligand InfoPC cidPC sid
In DepthDetails ArticlePubMed
TargetC-X-C chemokine receptor type 4(Homo sapiens (Human))
Kyowa Kirin
Curated by ChEMBL
LigandPNGBDBM50517142(CHEMBL4566228)
Affinity DataIC50: >1.00E+4nM. Assay description: Inhibition of CXCR4 expressed in human CAL1 cells assessed as reduction in SDF1alpha-induced intracellular calcium ion concentration preincubated for...
Ligand InfoPC cidPC sid
In DepthDetails ArticlePubMed