BDBM52389 MLS000543236::N-[5-acetyl-6-[(E)-2-(dimethylamino)ethenyl]-2-oxo-3-pyranyl]-4-methoxybenzamide::N-[5-acetyl-6-[(E)-2-(dimethylamino)ethenyl]-2-oxopyran-3-yl]-4-methoxybenzamide::N-[5-acetyl-6-[(E)-2-(dimethylamino)vinyl]-2-keto-pyran-3-yl]-4-methoxy-benzamide::N-[6-[(E)-2-(dimethylamino)ethenyl]-5-ethanoyl-2-oxidanylidene-pyran-3-yl]-4-methoxy-benzamide::N-{5-acetyl-6-[2-(dimethylamino)vinyl]-2-oxo-2H-pyran-3-yl}-4-methoxybenzenecarboxamide::SMR000169205::cid_1473628
SMILES COc1ccc(cc1)C(=O)Nc1cc(C(C)=O)c(C=CN(C)C)oc1=O
InChI Key InChIKey=GRINWRRGVWZKHM-UHFFFAOYSA-N
Data  4 EC50
  Tab Delimited (TSV)   2D SDfile   Computed 3D by Vconf -m prep SDfile
Find this compound or compounds like it in BindingDB:
Activity Spreadsheet -- Enzyme Inhibition Constant Data from BindingDB
Found 4 hits for monomerid = 52389
TargetPOsterior Segregation(Caenorhabditis elegans)
Broad Institute
Curated by PubChem BioAssay
LigandPNGBDBM52389(MLS000543236 | N-[5-acetyl-6-[(E)-2-(dimethylamino...)
Affinity DataEC50:  5.41E+4nM. Assay description: Broad Institute: MLPCN maternal gene expression Project ID: 2024 Keywords: Zinc finger, C. elegans, maternal gene expression, RNA-protein interac...
In DepthDetails PCBioAssay
TargetCorticotropin-releasing factor-binding protein(Homo sapiens (Human))
Burnham Center For Chemical Genomics
Curated by PubChem BioAssay
LigandPNGBDBM52389(MLS000543236 | N-[5-acetyl-6-[(E)-2-(dimethylamino...)
Affinity DataEC50:  6.69E+3nM. Assay description: Data Source: Sanford-Burnham Center for Chemical Genomics (SBCCG) Source Affiliation: Sanford-Burnham Medical Research Institute (SBMRI, San Diego, C...
In DepthDetails PCBioAssay
TargetTropomyosin alpha-1 chain(Sus scrofa)
The Scripps Research Institute Molecular Screening Center
Curated by PubChem BioAssay
LigandPNGBDBM52389(MLS000543236 | N-[5-acetyl-6-[(E)-2-(dimethylamino...)
Affinity DataEC50:  1.05E+4nM. Assay description: Source (MLPCN Center Name): The Scripps Research Institute Molecular Screening Center (SRIMSC) Affiliation: The Scripps Research Institute, TSRI Assa...
In DepthDetails PCBioAssay
TargetZinc finger protein mex-5(Caenorhabditis elegans)
Broad Institute
Curated by PubChem BioAssay
LigandPNGBDBM52389(MLS000543236 | N-[5-acetyl-6-[(E)-2-(dimethylamino...)
Affinity DataEC50:  5.48E+4nM. Assay description: Broad Institute: MLPCN maternal gene expression Project ID: 2024 Keywords: Zinc finger, C. elegans, maternal gene expression, RNA-protein interac...
In DepthDetails PCBioAssay