BDBM53601 MLS000551084::N-[[5-(2-nitrophenyl)-2-furanyl]methylideneamino]-3-pyridinecarboxamide::N-[[5-(2-nitrophenyl)-2-furyl]methyleneamino]nicotinamide::N-[[5-(2-nitrophenyl)furan-2-yl]methylideneamino]pyridine-3-carboxamide::Nicotinic acid [5-(2-nitro-phenyl)-furan-2-ylmethylene]-hydrazide::SMR000175043::cid_556042
SMILES [O-][N+](=O)c1ccccc1-c1ccc([CH+][N-]NC(=O)c2cccnc2)o1
InChI Key InChIKey=DSNVGTOOEYTJFH-UHFFFAOYSA-N
Data  4 IC50
  Tab Delimited (TSV)   2D SDfile   Computed 3D by Vconf -m prep SDfile
Find this compound or compounds like it in BindingDB:
Activity Spreadsheet -- Enzyme Inhibition Constant Data from BindingDB
Found 4 hits for monomerid = 53601
TargetMannose-6-phosphate isomerase(Homo sapiens (Human))
Sanford-Burnham Center For Chemical Genomics
Curated by PubChem BioAssay
LigandPNGBDBM53601(MLS000551084 | N-[[5-(2-nitrophenyl)-2-furanyl]met...)
Affinity DataIC50:  5.00E+4nM. Assay description: Data Source: Sanford-Burnham Center for Chemical Genomics (SBCCG) Source Affiliation: Sanford-Burnham Medical Research Institute (SBMRI, San Diego, C...
In DepthDetails PCBioAssay
TargetCaspase-9(Homo sapiens (Human))
Burnham Center For Chemical Genomics
Curated by PubChem BioAssay
LigandPNGBDBM53601(MLS000551084 | N-[[5-(2-nitrophenyl)-2-furanyl]met...)
Affinity DataIC50:  2.34E+4nM. Assay description: Data Source: Sanford-Burnham Center for Chemical Genomics (SBCCG) Source Affiliation: Sanford-Burnham Medical Research Institute (SBIMR, San Diego, C...
In DepthDetails PCBioAssay
TargetApoptotic protease-activating factor 1(Homo sapiens (Human))
Burnham Center For Chemical Genomics
Curated by PubChem BioAssay
LigandPNGBDBM53601(MLS000551084 | N-[[5-(2-nitrophenyl)-2-furanyl]met...)
Affinity DataIC50: >1.00E+5nM. Assay description: Data Source: Sanford-Burnham Center for Chemical Genomics (SBCCG) Source Affiliation: Sanford-Burnham Medical Research Institute (SBIMR, San Diego, C...
In DepthDetails PCBioAssay
TargetApoptotic protease-activating factor 1(Homo sapiens (Human))
Burnham Center For Chemical Genomics
Curated by PubChem BioAssay
LigandPNGBDBM53601(MLS000551084 | N-[[5-(2-nitrophenyl)-2-furanyl]met...)
Affinity DataIC50:  3.92E+4nM. Assay description: Data Source: Sanford-Burnham Center for Chemical Genomics (SBCCG) Source Affiliation: Sanford-Burnham Medical Research Institute (SBIMR, San Diego, C...
In DepthDetails PCBioAssay