BDBM5454 6-alkoxy-4-anilinoquinazoline 13a::N-[4-(benzyloxy)phenyl]-6-{3-[(2-methanesulfonylethyl)(methyl)amino]propoxy}quinazolin-4-amine
SMILES CN(CCCOc1ccc2ncnc(Nc3ccc(OCc4ccccc4)cc3)c2c1)CCS(C)(=O)=O
InChI Key InChIKey=XOQKZEMXCAEBHU-UHFFFAOYSA-N
Data  2 IC50
  Tab Delimited (TSV)   2D SDfile   Computed 3D by Vconf -m prep SDfile
Find this compound or compounds like it in BindingDB:
Activity Spreadsheet -- Enzyme Inhibition Constant Data from BindingDB
Found 2 hits for monomerid = 5454
TargetReceptor tyrosine-protein kinase erbB-2(Homo sapiens (Human))
Glaxosmithkline
LigandPNGBDBM5454(6-alkoxy-4-anilinoquinazoline 13a | N-[4-(benzylox...)
Affinity DataIC50:  1.78E+3nMpH: 7.5 T: 2°C. Assay description: Enzymatic reactions were initiated by adding kinase to the reaction mixture containing ATP, [gamma-33P] ATP, peptide substrate and test inhibitor com...
In DepthDetails ArticlePubMed
TargetEpidermal growth factor receptor(Homo sapiens (Human))
Glaxosmithkline
LigandPNGBDBM5454(6-alkoxy-4-anilinoquinazoline 13a | N-[4-(benzylox...)
Affinity DataIC50:  830nMpH: 7.5 T: 2°C. Assay description: Enzymatic reactions were initiated by adding kinase to the reaction mixture containing ATP, [gamma-33P] ATP, peptide substrate and test inhibitor com...
In DepthDetails ArticlePubMed