BDBM61892 MLS001303550::N-(1,3-benzothiazol-2-yl)-2-[(3-cyano-5-hydroxy-7-keto-4H-thieno[3,2-b]pyridin-2-yl)thio]acetamide::N-(1,3-benzothiazol-2-yl)-2-[(3-cyano-5-hydroxy-7-oxo-4H-thieno[3,2-b]pyridin-2-yl)sulfanyl]acetamide::N-(1,3-benzothiazol-2-yl)-2-[(3-cyano-5-hydroxy-7-oxo-4H-thieno[3,2-b]pyridin-2-yl)thio]acetamide::N-(1,3-benzothiazol-2-yl)-2-[(3-cyano-5-oxidanyl-7-oxidanylidene-4H-thieno[3,2-b]pyridin-2-yl)sulfanyl]ethanamide::N-(1,3-benzothiazol-2-yl)-2-[(3-cyano-7-hydroxy-5-keto-4H-thieno[3,2-b]pyridin-2-yl)thio]acetamide::N-Benzothiazol-2-yl-2-(3-cyano-7-hydroxy-5-oxo-4,5-dihydro-thieno[3,2-b]pyridin-2-ylsulfanyl)-acetamide::SMR000606648::cid_6499473
SMILES Oc1cc(=O)[nH]c2c(C#N)c(SCC(=O)Nc3nc4ccccc4s3)sc12
InChI Key InChIKey=UZHXBLBWHKAGOE-UHFFFAOYSA-N
Data  7 IC50
  Tab Delimited (TSV)   2D SDfile   Computed 3D by Vconf -m prep SDfile
Find this compound or compounds like it in BindingDB:
Activity Spreadsheet -- Enzyme Inhibition Constant Data from BindingDB
Found 7 hits for monomerid = 61892
TargetInduced myeloid leukemia cell differentiation protein Mcl-1(Homo sapiens (Human))
The Scripps Research Institute Molecular Screening Center
Curated by PubChem BioAssay
LigandPNGBDBM61892(MLS001303550 | N-(1,3-benzothiazol-2-yl)-2-[(3-cya...)
Affinity DataIC50:  3.39E+4nM. Assay description: Source (MLPCN Center Name): The Scripps Research Institute Molecular Screening Center Affiliation: The Scripps Research Institute, TSRI Assay Provide...
In DepthDetails PCBioAssay
TargetBcl-2-like protein 1(Homo sapiens (Human))
The Scripps Research Institute Molecular Screening Center
Curated by PubChem BioAssay
LigandPNGBDBM61892(MLS001303550 | N-(1,3-benzothiazol-2-yl)-2-[(3-cya...)
Affinity DataIC50:  6.33E+4nM. Assay description: Source (MLPCN Center Name): The Scripps Research Institute Molecular Screening Center Affiliation: The Scripps Research Institute, TSRI Assay Provide...
In DepthDetails PCBioAssay
TargetIntestinal-type alkaline phosphatase(Homo sapiens (Human))
Burnham Center For Chemical Genomics
Curated by PubChem BioAssay
LigandPNGBDBM61892(MLS001303550 | N-(1,3-benzothiazol-2-yl)-2-[(3-cya...)
Affinity DataIC50: >1.00E+5nM. Assay description: Data Source: Sanford-Burnham Center for Chemical Genomics (SBCCG) Source Affiliation: Sanford-Burnham Medical Research Institute(SBMRI, San Diego, CA...
In DepthDetails PCBioAssay
TargetHuntingtin(Homo sapiens (Human))
The Scripps Research Institute Molecular Screening Center
Curated by PubChem BioAssay
LigandPNGBDBM61892(MLS001303550 | N-(1,3-benzothiazol-2-yl)-2-[(3-cya...)
Affinity DataIC50:  2.41E+3nM
In DepthDetails PCBioAssay
TargetAlkaline phosphatase, tissue-nonspecific isozyme(Homo sapiens (Human))
Burnham Center For Chemical Genomics
Curated by PubChem BioAssay
LigandPNGBDBM61892(MLS001303550 | N-(1,3-benzothiazol-2-yl)-2-[(3-cya...)
Affinity DataIC50: >1.00E+5nM. Assay description: Data Source: Sanford-Burnham Center for Chemical Genomics (SBCCG) Source Affiliation: Sanford-Burnham Medical Research Institute (SBMRI, San Diego, C...
In DepthDetails PCBioAssay
TargetIntestinal-type alkaline phosphatase 1(Rattus norvegicus (Rat))
Burnham Center For Chemical Genomics
Curated by PubChem BioAssay
LigandPNGBDBM61892(MLS001303550 | N-(1,3-benzothiazol-2-yl)-2-[(3-cya...)
Affinity DataIC50:  1.88E+4nM. Assay description: Data Source: Sanford-Burnham Center for Chemical Genomics (SBCCG) Source Affiliation: Sanford-Burnham Medical Research Institute (SBMRI, San Diego, C...
In DepthDetails PCBioAssay
TargetAlkaline phosphatase, germ cell type(Homo sapiens (Human))
Burnham Center For Chemical Genomics
Curated by PubChem BioAssay
LigandPNGBDBM61892(MLS001303550 | N-(1,3-benzothiazol-2-yl)-2-[(3-cya...)
Affinity DataIC50: >1.00E+5nM. Assay description: Data Source: Sanford-Burnham Center for Chemical Genomics (SBCCG) Source Affiliation: Sanford-Burnham Medical Research Institute (SBMRI, San Diego, C...
In DepthDetails PCBioAssay