BDBM65443 US9533985, 232
SMILES Cn1c2cnccc2c(=O)n(-c2ccc(C[C@H](NC(=O)c3cc(F)c(NS(=O)(=O)c4ccc(cc4)-c4cnc(nc4)N4CCC4)cc3F)C(O)=O)nc2)c1=O
InChI Key InChIKey=CYQMMKLVHAEXLM-PMERELPUSA-N
Data  1 IC50
  Tab Delimited (TSV)   2D SDfile   Computed 3D by Vconf -m prep SDfile
Find this compound or compounds like it in BindingDB:
Activity Spreadsheet -- Enzyme Inhibition Constant Data from BindingDB
Found 1 hit for monomerid = 65443
LigandPNGBDBM65443(US9533985, 232)
Affinity DataIC50: <200nMpH: 9.6 T: 2°C. Assay description: The ability of test substances to inhibit the binding of a human B cell line, RPMI-8866, which is known to express α4β7 integrin, to MAdCA...
In DepthDetails US Patent