BDBM65579 4-ureidophenyl sulfamate ring derivative 3ae
SMILES COC(=O)c1ccc(NC(=O)Nc2ccc(OS(N)(=O)=O)cc2)cc1
InChI Key InChIKey=DFIBXICROCGKSF-UHFFFAOYSA-N
Data  1 KI
  Tab Delimited (TSV)   2D SDfile   Computed 3D by Vconf -m prep SDfile
Find this compound or compounds like it in BindingDB:
Activity Spreadsheet -- Enzyme Inhibition Constant Data from BindingDB
Found 1 hit for monomerid = 65579
TargetCarbonic anhydrase 9(Homo sapiens (Human))
Birla Institute of Technology
LigandPNGBDBM65579(4-ureidophenyl sulfamate ring derivative 3ae)
Affinity DataKi:  13nM
In DepthDetails ArticlePubMed