BDBM66171 4-(2-methylpropyl)-2-sulfanylidene-5,6,7,8-tetrahydro-1H-quinoline-3-carbonitrile::4-isobutyl-2-thioxo-1,2,5,6,7,8-hexahydro-3-quinolinecarbonitrile::4-isobutyl-2-thioxo-5,6,7,8-tetrahydro-1H-quinoline-3-carbonitrile::MLS000699928::SMR000225194::cid_2297665
SMILES CC(C)Cc1c2CCCCc2[nH]c(=S)c1C#N
InChI Key InChIKey=MTTRFZQQCCNCFR-UHFFFAOYSA-N
Data  3 IC50
  Tab Delimited (TSV)   2D SDfile   Computed 3D by Vconf -m prep SDfile
Find this compound or compounds like it in BindingDB:
Activity Spreadsheet -- Enzyme Inhibition Constant Data from BindingDB
Found 3 hits for monomerid = 66171
TargetPhotoreceptor-specific nuclear receptor(Homo sapiens (Human))
The Scripps Research Institute Molecular Screening Center
Curated by PubChem BioAssay
LigandPNGBDBM66171(4-(2-methylpropyl)-2-sulfanylidene-5,6,7,8-tetrahy...)
Affinity DataIC50: >3.98E+4nM. Assay description: Source (MLPCN Center Name): The Scripps Research Institute Molecular Screening Center Affiliation: The Scripps Research Institute, TSRI Assay Provide...
In DepthDetails PCBioAssay
TargetGroup 3 secretory phospholipase A2(Homo sapiens)
The Scripps Research Institute Molecular Screening Center
Curated by PubChem BioAssay
LigandPNGBDBM66171(4-(2-methylpropyl)-2-sulfanylidene-5,6,7,8-tetrahy...)
Affinity DataIC50:  1.22E+5nM. Assay description: Source (MLPCN Center Name): The Scripps Research Institute Molecular Screening Center Affiliation: The Scripps Research Institute, TSRI Assay Provide...
In DepthDetails PCBioAssay
TargetIsoform 2 of Nuclear receptor corepressor 2 (TRAC-1)(Homo sapiens (Human))
The Scripps Research Institute Molecular Screening Center
Curated by PubChem BioAssay
LigandPNGBDBM66171(4-(2-methylpropyl)-2-sulfanylidene-5,6,7,8-tetrahy...)
Affinity DataIC50:  6.27E+3nM. Assay description: Source (MLPCN Center Name): The Scripps Research Institute Molecular Screening Center Affiliation: The Scripps Research Institute, TSRI Assay Provide...
In DepthDetails PCBioAssay