BDBM67130 (2E)-2-[(4-methylpiperazino)methylene]-3-[[4-(4-sec-butylphenyl)thiazol-2-yl]methyl]-1H-quinazolin-4-one::(2E)-3-[[4-(4-butan-2-ylphenyl)-1,3-thiazol-2-yl]methyl]-2-[(4-methylpiperazin-1-yl)methylidene]-1H-quinazolin-4-one::(2E)-3-[[4-(4-butan-2-ylphenyl)-2-thiazolyl]methyl]-2-[(4-methyl-1-piperazinyl)methylidene]-1H-quinazolin-4-one::SR-03000000855-1::cid_25181303
SMILES CCC(C)c1ccc(cc1)-c1csc(Cn2c(CN3CCN(C)CC3)nc3ccccc3c2=O)n1
InChI Key InChIKey=GILSLIZEYPBWAI-UHFFFAOYSA-N
Data  2 IC50
  Tab Delimited (TSV)   2D SDfile   Computed 3D by Vconf -m prep SDfile
Find this compound or compounds like it in BindingDB:
Activity Spreadsheet -- Enzyme Inhibition Constant Data from BindingDB
Found 2 hits for monomerid = 67130
TargetSignal transducer and activator of transcription 1-alpha/beta(Homo sapiens (Human))
The Scripps Research Institute Molecular Screening Center
Curated by PubChem BioAssay
LigandPNGBDBM67130((2E)-2-[(4-methylpiperazino)methylene]-3-[[4-(4-se...)
Affinity DataIC50: >1.86E+4nM. Assay description: Source (MLPCN Center Name): The Scripps Research Institute Molecular Screening Center Center Affiliation: The Scripps Research Institute (TSRI) Assay...
In DepthDetails PCBioAssay
TargetSignal transducer and activator of transcription 3 [702-738,740-752](Homo sapiens (Human))
The Scripps Research Institute Molecular Screening Center
Curated by PubChem BioAssay
LigandPNGBDBM67130((2E)-2-[(4-methylpiperazino)methylene]-3-[[4-(4-se...)
Affinity DataIC50: >5.57E+4nM. Assay description: Source (MLPCN Center Name): The Scripps Research Institute Molecular Screening Center Center Affiliation: The Scripps Research Institute (TSRI) Assay...
In DepthDetails PCBioAssay