BDBM70347 6'-amino-1-benzyl-3'-isopropyl-1'H-spiro[piperidine-4,4'-pyrano[2,3-c]pyrazole]-5'-carbonitrile::6-amino-1'-(phenylmethyl)-3-propan-2-yl-5-spiro[2H-pyrano[2,3-c]pyrazole-4,4'-piperidine]carbonitrile::6-amino-1'-benzyl-3-isopropyl-spiro[2H-pyrano[2,3-c]pyrazole-4,4'-piperidine]-5-carbonitrile::6-amino-1'-benzyl-3-propan-2-ylspiro[2H-pyrano[2,3-c]pyrazole-4,4'-piperidine]-5-carbonitrile::6-azanyl-1'-(phenylmethyl)-3-propan-2-yl-spiro[2H-pyrano[2,3-c]pyrazole-4,4'-piperidine]-5-carbonitrile::MLS000045567::SMR000027524::cid_1044643
SMILES CC(C)c1[nH]nc2OC(=N)C(C#N)C3(CCN(Cc4ccccc4)CC3)c12
InChI Key InChIKey=CHLLQSBRMBVSRB-UHFFFAOYSA-N
Data  3 EC50
  Tab Delimited (TSV)   2D SDfile   Computed 3D by Vconf -m prep SDfile
Find this compound or compounds like it in BindingDB:
Activity Spreadsheet -- Enzyme Inhibition Constant Data from BindingDB
Found 3 hits for monomerid = 70347
TargetProtein RecA(Mycobacterium tuberculosis H37Rv)
Broad Institute
Curated by PubChem BioAssay
LigandPNGBDBM70347(6'-amino-1-benzyl-3'-isopropyl-1'H-spi...)
Affinity DataEC50:  2.13E+4nM. Assay description: Keywords: GFP, refolding, reducing reagent, GFP fluorescence Assay Overview: M. tuberculosis harbors three inteins, which interrupt the DnaB, RecA, a...
In DepthDetails PCBioAssay
TargetImportin subunit alpha-1(Homo sapiens (Human))
Broad Institute
Curated by PubChem BioAssay
LigandPNGBDBM70347(6'-amino-1-benzyl-3'-isopropyl-1'H-spi...)
Affinity DataEC50:  6.45E+4nM. Assay description: Keywords: Counterscreen, FRET assay, HTS, YIC probe, Dose response, Assay Overview: This is a fluorescence resonance energy transfer (FRET)-based b...
In DepthDetails PCBioAssay
TargetProtein RecA(Mycobacterium tuberculosis H37Rv)
Broad Institute
Curated by PubChem BioAssay
LigandPNGBDBM70347(6'-amino-1-benzyl-3'-isopropyl-1'H-spi...)
Affinity DataEC50:  1.16E+3nM. Assay description: Keywords: GFP-RecA intein, protein splicing, refolding, reducing reagent, GFP fluorescence Assay Overview: M. tuberculosis harbors three inteins, whi...
In DepthDetails PCBioAssay