BDBM77170 MLS000529376::N-(2-furanylmethyl)-1-[1-(2-methylbutan-2-yl)-5-tetrazolyl]-1-(4-methylphenyl)-N-(thiophen-2-ylmethyl)methanamine::N-(furan-2-ylmethyl)-1-[1-(2-methylbutan-2-yl)-1,2,3,4-tetrazol-5-yl]-1-(4-methylphenyl)-N-(thiophen-2-ylmethyl)methanamine::N-(furan-2-ylmethyl)-1-[1-(2-methylbutan-2-yl)tetrazol-5-yl]-1-(4-methylphenyl)-N-(thiophen-2-ylmethyl)methanamine::SMR000121851::[(1-tert-amyltetrazol-5-yl)-(p-tolyl)methyl]-(2-furfuryl)-(2-thenyl)amine::cid_3193727::{[1-(1,1-Dimethyl-propyl)-1H-tetrazol-5-yl]-p-tolyl-methyl}-furan-2-ylmethyl-thiophen-2-ylmethyl-amine
SMILES CCC(C)(C)n1nnnc1C(N(Cc1ccco1)Cc1cccs1)c1ccc(C)cc1
InChI Key InChIKey=KFNUXOPRMHDDEF-UHFFFAOYSA-N
Data  2 EC50
  Tab Delimited (TSV)   2D SDfile   Computed 3D by Vconf -m prep SDfile
Find this compound or compounds like it in BindingDB:
Activity Spreadsheet -- Enzyme Inhibition Constant Data from BindingDB
Found 2 hits for monomerid = 77170
TargetOrotidine 5'-phosphate decarboxylase(Aspergillus niger)
The Scripps Research Institute Molecular Screening Center
Curated by PubChem BioAssay
LigandPNGBDBM77170(MLS000529376 | N-(2-furanylmethyl)-1-[1-(2-methylb...)
Affinity DataEC50: >5.96E+4nM. Assay description: Source (MLPCN Center Name): The Scripps Research Institute Molecular Screening Center (SRISMC) Center Affiliation: The Scripps Research Institute, TS...
In DepthDetails PCBioAssay
TargetVoltage-dependent T-type calcium channel subunit alpha-1H(Homo sapiens (Human))
Vanderbilt Screening Center For Gpcrs, Ion Channels and Transporters
Curated by PubChem BioAssay
LigandPNGBDBM77170(MLS000529376 | N-(2-furanylmethyl)-1-[1-(2-methylb...)
Affinity DataEC50:  6.74E+3nM. Assay description: Assay Provider: Xinmin Xie Assay Provider Affiliation: Bioscience Division, SRI International, Menlo Park, CA Grant Title: HTS Assay for Cav3 T-Type ...
In DepthDetails PCBioAssay