BDBM81721 2,6,9-Trisubstituted Purine, 7
SMILES CCn1cnc2c(Nc3ccc(cc3)P(O)(=O)CP(O)(O)=O)nc(CC3CCCNC3)nc12
InChI Key InChIKey=YUYCTKQQRLKRSU-UHFFFAOYSA-N
Data  1 IC50
  Tab Delimited (TSV)   2D SDfile   Computed 3D by Vconf -m prep SDfile
Find this compound or compounds like it in BindingDB:
Activity Spreadsheet -- Enzyme Inhibition Constant Data from BindingDB
Found 1 hit for monomerid = 81721
TargetProto-oncogene tyrosine-protein kinase Src(Mus musculus (Mouse))
Ariad Pharmaceuticals
LigandPNGBDBM81721(2,6,9-Trisubstituted Purine, 7)
Affinity DataIC50:  2.30E+3nM. Assay description: 2,6,9-Trisubstituted purines were evaluated for their src kinase inhibitory activities using an ELISA assay.
In DepthDetails ArticlePubMed