BDBM82137 4-methoxy-N-({1-[2-(morpholin-4-yl)ethyl]-1H-indol-3-yl}methyl)aniline, 7
SMILES COc1ccc(NCc2cn(CCN3CCOCC3)c3ccccc23)cc1
InChI Key InChIKey=QEKAITOYZPOLHY-UHFFFAOYSA-N
Data  1 KI
  Tab Delimited (TSV)   2D SDfile   Computed 3D by Vconf -m prep SDfile
Find this compound or compounds like it in BindingDB:
Activity Spreadsheet -- Enzyme Inhibition Constant Data from BindingDB
Found 1 hit for monomerid = 82137
TargetCannabinoid receptor 1(Rattus norvegicus (rat))
UniversitÀ
LigandPNGBDBM82137(4-methoxy-N-({1-[2-(morpholin-4-yl)ethyl]-1H-indol...)
Affinity DataKi:  42.6nM ΔG°:  -10.0kcal/molepH: 7.4 T: 2°C. Assay description: CB1 competitive assay were performed in rat cerebellar membranes using [3H]WIN 55212-2 from Perkin-Elmer as a radioligand.
In DepthDetails ArticlePubMed