BDBM83595 3-hydroxy-N'-[1-oxo-3-[(5Z)-4-oxo-2-sulfanylidene-5-(thiophen-2-ylmethylidene)-3-thiazolidinyl]propyl]benzohydrazide::3-hydroxy-N'-[3-[(5Z)-4-keto-5-(2-thenylidene)-2-thioxo-thiazolidin-3-yl]propanoyl]benzohydrazide::3-hydroxy-N'-[3-[(5Z)-4-oxo-2-sulfanylidene-5-(thiophen-2-ylmethylidene)-1,3-thiazolidin-3-yl]propanoyl]benzohydrazide::3-oxidanyl-N'-[3-[(5Z)-4-oxidanylidene-2-sulfanylidene-5-(thiophen-2-ylmethylidene)-1,3-thiazolidin-3-yl]propanoyl]benzohydrazide::MLS000715153::SMR000275132::cid_1988602
SMILES Oc1cccc(c1)C(=O)NNC(=O)CCN1C(=S)S\C(=C/c2cccs2)C1=O
InChI Key InChIKey=ZTMIEMYQYNTOSF-UVTDQMKNSA-N
Data  2 IC50  2 EC50
  Tab Delimited (TSV)   2D SDfile   Computed 3D by Vconf -m prep SDfile
Find this compound or compounds like it in BindingDB:
Activity Spreadsheet -- Enzyme Inhibition Constant Data from BindingDB
Found 4 hits for monomerid = 83595
TargetEndoribonuclease toxin MazF(Escherichia coli str. K-12 substr. MG1655)
Burnham Center For Chemical Genomics
Curated by PubChem BioAssay
LigandPNGBDBM83595(3-hydroxy-N'-[1-oxo-3-[(5Z)-4-oxo-2-sulfanylidene-...)
Affinity DataEC50: >9.90E+4nM. Assay description: Data Source: Sanford-Burnham Center for Chemical Genomics (SBCCG) Source Affiliation: Sanford-Burnham Medical Research Institute (SBMRI, San Diego, C...
In DepthDetails PCBioAssay
TargetSentrin-specific protease 1(Homo sapiens (Human))
Burnham Center For Chemical Genomics
Curated by PubChem BioAssay
LigandPNGBDBM83595(3-hydroxy-N'-[1-oxo-3-[(5Z)-4-oxo-2-sulfanylidene-...)
Affinity DataIC50:  1.62E+4nM
In DepthDetails PCBioAssay
TargetSentrin-specific protease 1(Homo sapiens (Human))
Burnham Center For Chemical Genomics
Curated by PubChem BioAssay
LigandPNGBDBM83595(3-hydroxy-N'-[1-oxo-3-[(5Z)-4-oxo-2-sulfanylidene-...)
Affinity DataIC50:  2.19E+4nM
In DepthDetails PCBioAssay
TargetEndoribonuclease toxin MazF(Escherichia coli str. K-12 substr. MG1655)
Burnham Center For Chemical Genomics
Curated by PubChem BioAssay
LigandPNGBDBM83595(3-hydroxy-N'-[1-oxo-3-[(5Z)-4-oxo-2-sulfanylidene-...)
Affinity DataEC50: >9.90E+4nM. Assay description: Data Source: Sanford-Burnham Center for Chemical Genomics (SBCCG) Source Affiliation: Sanford-Burnham Medical Research Institute (SBMRI, San Diego, C...
In DepthDetails PCBioAssay