BDBM84261 3-(2-furoylamino)-4-methyl-benzoic acid [2-keto-2-[(4-phenylthiazol-2-yl)amino]ethyl] ester::3-[[2-furanyl(oxo)methyl]amino]-4-methylbenzoic acid [2-oxo-2-[(4-phenyl-2-thiazolyl)amino]ethyl] ester::MLS000390261::SMR000259525::[2-oxidanylidene-2-[(4-phenyl-1,3-thiazol-2-yl)amino]ethyl] 3-(furan-2-ylcarbonylamino)-4-methyl-benzoate::[2-oxo-2-[(4-phenyl-1,3-thiazol-2-yl)amino]ethyl] 3-(furan-2-carbonylamino)-4-methylbenzoate::cid_2340194
SMILES Cc1ccc(cc1NC(=O)c1ccco1)C(=O)OCC(=O)Nc1nc(cs1)-c1ccccc1
InChI Key InChIKey=SKVNACLQMJDJNT-UHFFFAOYSA-N
Data  1 EC50
  Tab Delimited (TSV)   2D SDfile   Computed 3D by Vconf -m prep SDfile
Find this compound or compounds like it in BindingDB:
Activity Spreadsheet -- Enzyme Inhibition Constant Data from BindingDB
Found 1 hit for monomerid = 84261
TargetBeta-2 adrenergic receptor(Homo sapiens (Human))
Nmmlsc
Curated by PubChem BioAssay
LigandPNGBDBM84261(3-(2-furoylamino)-4-methyl-benzoic acid [2-keto-2-...)
Affinity DataEC50:  1.41E+3nM. Assay description: University of New Mexico Assay Overview: Assay Support: R03 MH093192-01 Project Title: HTS for Non-Canonical Ligands for Beta 2 Adrenergic Receptor...
In DepthDetails PCBioAssay