BDBM84938 (6aR)-7-Methyl-4-isobutyl-4,6,6a¿¿¿¿,7,8,9,10,10a¿¿¿¿-octahydroindolo[4,3-fg]quinoline-9¿¿¿¿-carboxylic acid 2-hydroxy-1-methylpropyl ester 6-Methyl-1-(2-methylpropyl)ergoline-8¿¿¿¿-carboxylic acid 2-hydroxy-1-methylpropyl ester::(6aR)-7-Methyl-4-isobutyl-4,6,6aα,7,8,9,10,10aβ-octahydroindolo[4,3-fg]quinoline-9α-carboxylic acid 2-hydroxy-1-methylpropyl ester 6-Methyl-1-(2-methylpropyl)ergoline-8β-carboxylic acid 2-hydroxy-1-methylpropyl ester ::LY 197541::LY-197541
SMILES CC(C)Cn1cc2C[C@@H]3[C@H](C[C@H](CN3C)C(=O)OC(C)C(C)O)c3cccc1c23
InChI Key InChIKey=NRMCOBVLHDZQFD-XCXPZOIVSA-N
Data  3 KI
  Tab Delimited (TSV)   2D SDfile   Computed 3D by Vconf -m prep SDfile
Find this compound or compounds like it in BindingDB:
Activity Spreadsheet -- Enzyme Inhibition Constant Data from BindingDB
Found 3 hits for monomerid = 84938
LigandPNGBDBM84938((6aR)-7-Methyl-4-isobutyl-4,6,6a¿¿¿¿,7,8,9,10,10a¿...)
Affinity DataKi:  148nM
In DepthDetails PubMed
Target5-hydroxytryptamine receptor 2A(Monkey)
Eli Lilly
Curated by PDSP Ki Database
LigandPNGBDBM84938((6aR)-7-Methyl-4-isobutyl-4,6,6a¿¿¿¿,7,8,9,10,10a¿...)
Affinity DataKi:  153nM
In DepthDetails PubMed
Target5-hydroxytryptamine receptor 2A(Rattus norvegicus (rat))
Eli Lilly
Curated by PDSP Ki Database
LigandPNGBDBM84938((6aR)-7-Methyl-4-isobutyl-4,6,6a¿¿¿¿,7,8,9,10,10a¿...)
Affinity DataKi:  242nM
In DepthDetails PubMed