BDBM85415 RTI-113
SMILES CN1[C@H]2CC[C@@H]1[C@H]([C@H](C2)c1ccc(Cl)cc1)C(=O)Oc1ccccc1
InChI Key InChIKey=AAEKULYONKUBOZ-NBYUQASBSA-N
Data  3 KI
  Tab Delimited (TSV)   2D SDfile   Computed 3D by Vconf -m prep SDfile
Find this compound or compounds like it in BindingDB:
Activity Spreadsheet -- Enzyme Inhibition Constant Data from BindingDB
Found 3 hits for monomerid = 85415
TargetSodium-dependent dopamine transporter(Rattus norvegicus (rat))
Virginia Commonwealth University
Curated by PDSP Ki Database
LigandPNGBDBM85415(RTI-113)
Affinity DataKi:  1.98nM
In DepthDetails PubMed
TargetSodium-dependent serotonin transporter(Rattus norvegicus (rat))
Virginia Commonwealth University
Curated by PDSP Ki Database
LigandPNGBDBM85415(RTI-113)
Affinity DataKi:  2.34E+3nM
In DepthDetails PubMed
TargetNorepinephrine transporter(RAT)
Virginia Commonwealth University
Curated by PDSP Ki Database
LigandPNGBDBM85415(RTI-113)
Affinity DataKi:  2.93E+3nM
In DepthDetails PubMed