BDBM94748 2,3-diphenyl-N-(2-pyrrolidin-1-ylethyl)quinoxaline-6-carboxamide::2,3-diphenyl-N-(2-pyrrolidinoethyl)quinoxaline-6-carboxamide::2,3-diphenyl-N-[2-(1-pyrrolidinyl)ethyl]-6-quinoxalinecarboxamide::MLS001028558::SMR000634100::cid_22588045
SMILES O=C(NCCN1CCCC1)c1ccc2nc(-c3ccccc3)c(nc2c1)-c1ccccc1
InChI Key InChIKey=REFRNPWWMHBHCL-UHFFFAOYSA-N
Data  1 EC50
  Tab Delimited (TSV)   2D SDfile   Computed 3D by Vconf -m prep SDfile
Find this compound or compounds like it in BindingDB:
Activity Spreadsheet -- Enzyme Inhibition Constant Data from BindingDB
Found 1 hit for monomerid = 94748
TargetXylosyl- and glucuronyltransferase LARGE1(Homo sapiens (Human))
Burnham Center For Chemical Genomics
Curated by PubChem BioAssay
LigandPNGBDBM94748(2,3-diphenyl-N-(2-pyrrolidin-1-ylethyl)quinoxaline...)
Affinity DataEC50: >8.00E+4nM
In DepthDetails PCBioAssay