BDBM98043 (3S)-3-amino-4-(2-diphenoxyphosphorylpyrrolidin-1-yl)-4-oxo-butanoic acid::CHEMBL391720::Compound 10.3
SMILES N[C@@H](CC(O)=O)C(=O)N1CCCC1P(=O)(Oc1ccccc1)Oc1ccccc1
InChI Key InChIKey=NTSKOZMSQFZPKG-ZENAZSQFSA-N
Data  4 IC50
  Tab Delimited (TSV)   2D SDfile   Computed 3D by Vconf -m prep SDfile
Find this compound or compounds like it in BindingDB:
Activity Spreadsheet -- Enzyme Inhibition Constant Data from BindingDB
Found 4 hits for monomerid = 98043
TargetDipeptidyl peptidase 4(Homo sapiens (Human))
University of Anterwerp
LigandPNGBDBM98043((3S)-3-amino-4-(2-diphenoxyphosphorylpyrrolidin-1-...)
Affinity DataIC50: >1.00E+6nMpH: 8.3 T: 2°C. Assay description: Inhibitory concentration of the compound against Dipeptidyl peptidase IV (DPP IV) in Homo sapiens (human)is measured
In DepthDetails ArticlePubMed
TargetDipeptidyl peptidase 4(Homo sapiens (Human))
University of Anterwerp
LigandPNGBDBM98043((3S)-3-amino-4-(2-diphenoxyphosphorylpyrrolidin-1-...)
Affinity DataIC50: >1.00E+6nM. Assay description: Inhibition of human DPP4
In DepthDetails ArticlePubMed
TargetDipeptidyl peptidase 2(Homo sapiens (Human))
University Of Antwerp
Curated by ChEMBL
LigandPNGBDBM98043((3S)-3-amino-4-(2-diphenoxyphosphorylpyrrolidin-1-...)
Affinity DataIC50: >1.00E+6nM. Assay description: Inhibition of human DPP2
In DepthDetails ArticlePubMed
TargetDipeptidyl peptidase 8(Homo sapiens (Human))
University Of Antwerp
Curated by ChEMBL
LigandPNGBDBM98043((3S)-3-amino-4-(2-diphenoxyphosphorylpyrrolidin-1-...)
Affinity DataIC50: >1.00E+6nM. Assay description: Inhibition of human DPP8
In DepthDetails ArticlePubMed