BDBM99915 US8501961, 129
SMILES COc1ccc(cc1)S(=O)(=O)N(CC(C)C)C[C@@H](O)[C@H](Cc1ccccc1)NC(=O)O[C@H]1CC2OCCO[C@@H]2C1
InChI Key InChIKey=JRXDKTCILCAIFM-XMJIWAIOSA-N
Data  1 KI
  Tab Delimited (TSV)   2D SDfile   Computed 3D by Vconf -m prep SDfile
Find this compound or compounds like it in BindingDB:
Activity Spreadsheet -- Enzyme Inhibition Constant Data from BindingDB
Found 1 hit for monomerid = 99915
TargetGag-Pol polyprotein(Human immunodeficiency virus type 1 group M subtyp...)
Purdue Research Foundation
US Patent
LigandPNGBDBM99915(US8501961, 129)
Affinity DataKi:  0.5nM. Assay description: Enzyme inhibitory assay utilizes a protocol described by Toth and Marshall (Toth, M. V.; Marshall G.R. A simple, continuous fluormetric assay for HIV...
In DepthDetails US Patent