Target
Carboxypeptidase B2
Ligand
BDBM173893
Substrate
Meas. Tech.
TAFI Activity Assay
pH
7.4±n/a
Temperature
298.15±n/a K
IC50
9044±n/a nM
Comments
extracted
Citation
 Kallus, CBroenstrup, MEvers, AGlobisch, ASchreuder, HWagner, M Macrocyclic urea and sulfamide derivatives as inhibitors of TAFIa US Patent  US9688645 Publication Date 6/27/2017 
Target
Name:
Carboxypeptidase B2
Synonyms:
CBPB2_HUMAN CPU Carboxypeptidase B2 isoform A Plasma carboxypeptidase B Thrombin-activable fibrinolysis inhibitor | pCPB
Type:
Enzyme
Mol. Mass.:
48432.74
Organism:
Homo sapiens (Human)
Description:
Q96IY4
Residue:
423
  
Inhibitor
Name:
BDBM173893
Synonyms:
US9688645, 1-2
Type:
Small organic molecule
Emp. Form.:
C22H34N4O6
Mol. Mass.:
450.5286
SMILES:
NCCCC[C@H](NC(=O)N[C@@H]1Cc2ccc(OCCCCOCCNC1=O)cc2)C(O)=O
: