Target
Carboxypeptidase B2
Ligand
BDBM173900
Substrate
Meas. Tech.
TAFI Activity Assay
pH
7.4±n/a
Temperature
298.15±n/a K
IC50
49±n/a nM
Comments
extracted
Citation
 Kallus, CBroenstrup, MEvers, AGlobisch, ASchreuder, HWagner, M Macrocyclic urea and sulfamide derivatives as inhibitors of TAFIa US Patent  US9688645 Publication Date 6/27/2017 
Target
Name:
Carboxypeptidase B2
Synonyms:
CBPB2_HUMAN CPU Carboxypeptidase B2 isoform A Plasma carboxypeptidase B Thrombin-activable fibrinolysis inhibitor | pCPB
Type:
Enzyme
Mol. Mass.:
48432.74
Organism:
Homo sapiens (Human)
Description:
Q96IY4
Residue:
423
  
Inhibitor
Name:
BDBM173900
Synonyms:
US9688645, 1-7
Type:
Small organic molecule
Emp. Form.:
C25H40N4O6
Mol. Mass.:
492.6083
SMILES:
CCC[C@H]1COCCCCOc2ccc(C[C@@H](NC(=O)N[C@@H](CCCCN)C(O)=O)C(=O)N1)cc2
: